Target
DNA-(apurinic or apyrimidinic site) endonuclease
Ligand
BDBM50453735
Substrate
Meas. Tech.
ChEMBL_1750388 (CHEMBL4185148)
IC50
1800±n/a nM
Citation
 Laev, SSSalakhutdinov, NFLavrik, OI Inhibitors of nuclease and redox activity of apurinic/apyrimidinic endonuclease 1/redox effector factor 1 (APE1/Ref-1). Bioorg Med Chem 25:2531-2544 (2017)  
Target
Name:
DNA-(apurinic or apyrimidinic site) endonuclease
Synonyms:
APE APEX APEX1_HUMAN Apurinic-apyrimidinic endonuclease 1 (APE-1) DNA-(apurinic or apyrimidinic site) lyase REF1
Type:
Protein
Mol. Mass.:
35560.12
Organism:
Homo sapiens (Human)
Description:
P27695
Residue:
318
  
Inhibitor
Name:
BDBM50453735
Synonyms:
CHEMBL4210283
Type:
Small organic molecule
Emp. Form.:
C24H20ClN3O7
Mol. Mass.:
497.885
SMILES:
[H][C@]12[C@@H](CCC(O)=O)N[C@@]3(C(=O)Nc4c3cccc4Cl)[C@@]1([H])C(=O)N(Cc1ccc3OCOc3c1)C2=O
: