Target
DNA-(apurinic or apyrimidinic site) endonuclease
Ligand
BDBM26614
Substrate
Meas. Tech.
ChEMBL_1750386 (CHEMBL4185146)
IC50
1700±n/a nM
Citation
 Laev, SSSalakhutdinov, NFLavrik, OI Inhibitors of nuclease and redox activity of apurinic/apyrimidinic endonuclease 1/redox effector factor 1 (APE1/Ref-1). Bioorg Med Chem 25:2531-2544 (2017)  
Target
Name:
DNA-(apurinic or apyrimidinic site) endonuclease
Synonyms:
APE APEX APEX1_HUMAN Apurinic-apyrimidinic endonuclease 1 (APE-1) DNA-(apurinic or apyrimidinic site) lyase REF1
Type:
Protein
Mol. Mass.:
35560.12
Organism:
Homo sapiens (Human)
Description:
P27695
Residue:
318
  
Inhibitor
Name:
BDBM26614
Synonyms:
2-[(4-hydroxy-3-methylphenyl)[(1Z)-3-methyl-4-oxocyclohexa-2,5-dien-1-ylidene]methyl]benzoic acid | Compound 10470
Type:
Small organic molecule
Emp. Form.:
C22H18O4
Mol. Mass.:
346.3759
SMILES:
CC1=C\C(C=CC1=O)=C(\c1ccc(O)c(C)c1)c1ccccc1C(O)=O
: