Target
Histone acetyltransferase p300
Ligand
BDBM50453949
Substrate
Meas. Tech.
ChEMBL_1751670 (CHEMBL4186430)
Kd
0.120000±n/a nM
Citation
 Lai, KWRomero, FATsui, VBeresini, MHde Leon Boenig, GBronner, SMChen, KChen, ZChoo, EFCrawford, TDCyr, PKaufman, SLi, YLiao, JLiu, WLy, JMurray, JShen, WWai, JWang, FZhu, CZhu, XMagnuson, S Design and synthesis of a biaryl series as inhibitors for the bromodomains of CBP/P300. Bioorg Med Chem Lett 28:15-23 (2018)  
Target
Name:
Histone acetyltransferase p300
Synonyms:
EP300 HIF1A/p300/CREB-binding protein P300
Type:
Protein
Mol. Mass.:
264223.04
Organism:
Homo sapiens (Human)
Description:
Q09472
Residue:
2414
  
Inhibitor
Name:
BDBM50453949
Synonyms:
CHEMBL4208820 | US11247989, Example 87
Type:
Small organic molecule
Emp. Form.:
C29H30N6O3
Mol. Mass.:
510.5869
SMILES:
CNC(=O)c1ccc(cn1)-c1cc2cccc(-c3nn(C4CCOCC4)c4CCN(Cc34)C(C)=O)c2cn1
: