Target
Tubulin alpha-1A chain
Ligand
BDBM50020475
Substrate
Meas. Tech.
ChEBML_211863
IC50
860.0±n/a nM
Citation
 Kruse, LILadd, DLHarrsch, PBMcCabe, FLMong, SMFaucette, LJohnson, R Synthesis, tubulin binding, antineoplastic evaluation, and structure-activity relationship of oncodazole analogues. J Med Chem 32:409-17 (1989)  
Target
Name:
Tubulin alpha-1A chain
Synonyms:
TBA1A_PIG Tubulin Tubulin alpha-1A chain
Type:
Protein
Mol. Mass.:
50049.25
Organism:
Sus scrofa (Pig)
Description:
P02550
Residue:
451
  
Inhibitor
Name:
BDBM50020475
Synonyms:
CHEMBL341192 | [7-Methyl-5-(thiophene-2-carbonyl)-1H-benzoimidazol-2-yl]-carbamic acid methyl ester
Type:
Small organic molecule
Emp. Form.:
C15H13N3O3S
Mol. Mass.:
315.347
SMILES:
COC(=O)Nc1nc2c(C)cc(cc2[nH]1)C(=O)c1cccs1
: