Target
Carbonic anhydrase 5A, mitochondrial
Ligand
BDBM50329832
Substrate
Meas. Tech.
ChEMBL_1752575 (CHEMBL4187335)
Kd
0.250000±n/a nM
Citation
 ?apkauskait?, EZak?auskas, ARuibys, VLinkuvien?, VPaketuryt?, VGedgaudas, MKairys, VMatulis, D Benzimidazole design, synthesis, and docking to build selective carbonic anhydrase VA inhibitors. Bioorg Med Chem 26:675-687 (2018)  
Target
Name:
Carbonic anhydrase 5A, mitochondrial
Synonyms:
CA-VA CA5A Carbonate dehydratase VA Carbonic anhydrase 5A (CA VA) Carbonic anhydrase 5A, mitochondrial precursor Carbonic anhydrase VA (CA VA)
Type:
Enzyme
Mol. Mass.:
34755.54
Organism:
Homo sapiens (Human)
Description:
Human (cloned) isozyme
Residue:
305
  
Inhibitor
Name:
BDBM50329832
Synonyms:
5-(1H-Benzimidazol-1-ylacetyl)-2-chlorobenzenesulfonamide N-alkylated benzimidazole derivative, 4a | carbonic anhydrase (CA) inhibitors, benzenesulphonamide ligand, 4
Type:
Small organic molecule
Emp. Form.:
C15H12ClN3O3S
Mol. Mass.:
349.792
SMILES:
NS(=O)(=O)c1cc(ccc1Cl)C(=O)Cn1cnc2ccccc12
: