Target
Carbonic anhydrase 4
Ligand
BDBM10880
Substrate
Meas. Tech.
ChEMBL_1752586 (CHEMBL4187346)
Kd
14±n/a nM
Citation
 ?apkauskait?, EZak?auskas, ARuibys, VLinkuvien?, VPaketuryt?, VGedgaudas, MKairys, VMatulis, D Benzimidazole design, synthesis, and docking to build selective carbonic anhydrase VA inhibitors. Bioorg Med Chem 26:675-687 (2018)  
Target
Name:
Carbonic anhydrase 4
Synonyms:
CA-IV CAH4_HUMAN Carbonic anhydrase Carbonic anhydrase IV (CA IV)
Type:
Enzyme
Mol. Mass.:
35037.98
Organism:
Homo sapiens (Human)
Description:
P22748
Residue:
312
  
Inhibitor
Name:
BDBM10880
Synonyms:
AZA AZM acetazolamide Acetazolamide Acetazolamide (AZA) Acetazolamide, 5 Acetazolamide, AZA CHEMBL20 Sulfonamide, 1 US11278534, Example acetazolamide sulfonamide 1
Type:
Small organic molecule
Emp. Form.:
C4H6N4O3S2
Mol. Mass.:
222.245
SMILES:
CC(=O)Nc1nnc(s1)S(N)(=O)=O
: