Target
Carbonic anhydrase 5A, mitochondrial
Ligand
BDBM50454303
Substrate
Meas. Tech.
ChEMBL_1752575 (CHEMBL4187335)
Kd
1.8±n/a nM
Citation
 ?apkauskait?, EZak?auskas, ARuibys, VLinkuvien?, VPaketuryt?, VGedgaudas, MKairys, VMatulis, D Benzimidazole design, synthesis, and docking to build selective carbonic anhydrase VA inhibitors. Bioorg Med Chem 26:675-687 (2018)  
Target
Name:
Carbonic anhydrase 5A, mitochondrial
Synonyms:
CA-VA CA5A Carbonate dehydratase VA Carbonic anhydrase 5A (CA VA) Carbonic anhydrase 5A, mitochondrial precursor Carbonic anhydrase VA (CA VA)
Type:
Enzyme
Mol. Mass.:
34755.54
Organism:
Homo sapiens (Human)
Description:
Human (cloned) isozyme
Residue:
305
  
Inhibitor
Name:
BDBM50454303
Synonyms:
CHEMBL4207063
Type:
Small organic molecule
Emp. Form.:
C15H11Cl2N3O3S
Mol. Mass.:
384.237
SMILES:
NS(=O)(=O)c1cc(C(=O)Cn2cnc3ccccc23)c(Cl)cc1Cl
: