Target
Amine oxidase [flavin-containing] A
Ligand
BDBM19459
Substrate
Meas. Tech.
ChEMBL_1753078 (CHEMBL4187838)
IC50
3900±n/a nM
Citation
 Baek, SCLee, HWRyu, HWKang, MGPark, DKim, SHCho, MLOh, SRKim, H Selective inhibition of monoamine oxidase A by hispidol. Bioorg Med Chem Lett 28:584-588 (2018)  
Target
Name:
Amine oxidase [flavin-containing] A
Synonyms:
AOFA_HUMAN MAO-A Monoamine oxidase Monoamine oxidase type A (MAO A) Monoamine oxidase type A (MAOA)
Type:
Protein
Mol. Mass.:
59689.53
Organism:
Homo sapiens (Human)
Description:
P21397
Residue:
527
  
Inhibitor
Name:
BDBM19459
Synonyms:
5,7-dihydroxy-3-(4-hydroxyphenyl)-4H-chromen-4-one Genistein Genisteol US8552057, 2 | cid_5280961
Type:
Phytoestrogen
Emp. Form.:
C15H10O5
Mol. Mass.:
270.2369
SMILES:
Oc1ccc(cc1)-c1coc2cc(O)cc(O)c2c1=O
: