Target
5-hydroxytryptamine receptor 1A
Ligand
BDBM50020703
Substrate
Meas. Tech.
ChEBML_1318
Ki
4±n/a nM
Citation
 Glennon, RATiteler, MLyon, RASlusher, RM N,N-di-n-propylserotonin: binding at serotonin binding sites and a comparison with 8-hydroxy-2-(di-n-propylamino)tetralin. J Med Chem 31:867-70 (1988)  
Target
Name:
5-hydroxytryptamine receptor 1A
Synonyms:
5-HT-1A 5-HT1A 5-hydroxytryptamine receptor 1A (5HT1A) 5ht1a Htr1a Serotonin 1a (5-HT1a) receptor/Adrenergic receptor alpha-1 | Serotonin receptor 1A
Type:
G Protein-Coupled Receptor (GPCR)
Mol. Mass.:
46445.29
Organism:
Rattus norvegicus (rat)
Description:
Binding assays were performed using rat hippocampal membranes.
Residue:
422
  
Inhibitor
Name:
BDBM50020703
Synonyms:
CHEMBL169328 | [2-(5-Methoxy-1H-indol-3-yl)-ethyl]-dipropyl-amine(O-Me-DiPS)
Type:
Small organic molecule
Emp. Form.:
C17H26N2O
Mol. Mass.:
274.4011
SMILES:
CCCN(CCC)CCc1c[nH]c2ccc(OC)cc12
: