Target
NADPH oxidase 4
Ligand
BDBM50455024
Substrate
Meas. Tech.
ChEMBL_1753700 (CHEMBL4188460)
IC50
27000±n/a nM
Citation
 Xu, QKulkarni, AASajith, AMHussein, DBrown, DGüner, OFReddy, MDWatkins, EBLassègue, BGriendling, KKBowen, JP Design, synthesis, and biological evaluation of inhibitors of the NADPH oxidase, Nox4. Bioorg Med Chem 26:989-998 (2018)  
Target
Name:
NADPH oxidase 4
Synonyms:
KOX-1 Kidney superoxide-producing NADPH oxidase NOX4_HUMAN Renal NAD(P)H-oxidase
Type:
PROTEIN
Mol. Mass.:
66954.54
Organism:
Homo sapiens (Human)
Description:
ChEMBL_792879
Residue:
578
  
Inhibitor
Name:
BDBM50455024
Synonyms:
CHEMBL4205860
Type:
Small organic molecule
Emp. Form.:
C18H17F3N2O4S
Mol. Mass.:
414.399
SMILES:
COc1ccc(cc1)S(=O)(=O)N1CCCN(C1=O)c1ccc(cc1)C(F)(F)F
: