Target
Cyclin-dependent kinase 4
Ligand
BDBM448932
Substrate
Meas. Tech.
ChEMBL_1753761 (CHEMBL4188521)
IC50
0.600000±n/a nM
Citation
 Wang, YLiu, WJYin, LLi, HChen, ZHZhu, DXSong, XQCheng, ZZSong, PWang, ZLi, ZG Design and synthesis of 4-(2,3-dihydro-1H-benzo[d]pyrrolo[1,2-a]imidazol-7-yl)-N-(5-(piperazin-1-ylmethyl)pyridine-2-yl)pyrimidin-2-amine as a highly potent and selective cyclin-dependent kinases 4 and 6 inhibitors and the discovery of structure-activity relationships. Bioorg Med Chem Lett 28:974-978 (2018)  
Target
Name:
Cyclin-dependent kinase 4
Synonyms:
CDK4 Cell division protein kinase 4 PSK-J3
Type:
Enzyme Subunit
Mol. Mass.:
33731.96
Organism:
Homo sapiens (Human)
Description:
P11802
Residue:
303
  
Inhibitor
Name:
BDBM448932
Synonyms:
5-Fluoro-4-(5-fluoro-1,1-dimethyl-2,3-dihydro-1H-benzo[d]pyrrolo[1,2-a]imidazol-7-yl)-N-(5-(piperazin-1-ylmethyl)pyridin-2-yl)pyrimidin-2-amine US10696678, Example 27
Type:
Small organic molecule
Emp. Form.:
C26H28F2N8
Mol. Mass.:
490.5509
SMILES:
CC1(C)CCc2nc3c(F)cc(cc3n12)-c1nc(Nc2ccc(CN3CCNCC3)cn2)ncc1F
: