Target
Steroid hormone receptor ERR2
Ligand
BDBM50455417
Substrate
Meas. Tech.
ChEMBL_1754410 (CHEMBL4189170)
EC50
45±n/a nM
Citation
 Lin, HDoebelin, CPatouret, RGarcia-Ordonez, RDChang, MRDharmarajan, VBayona, CRCameron, MDGriffin, PRKamenecka, TM Design, synthesis, and evaluation of simple phenol amides as ERR? agonists. Bioorg Med Chem Lett 28:1313-1319 (2018)  
Target
Name:
Steroid hormone receptor ERR2
Synonyms:
ERR beta-2 ERR2_HUMAN ESRL2 Estrogen receptor-like 2 NR3B2 Steroid hormone receptor ERR2 | Steroid hormone receptor ERR2 Beta
Type:
PROTEIN
Mol. Mass.:
48061.77
Organism:
Homo sapiens (Human)
Description:
ChEMBL_11254
Residue:
433
  
Inhibitor
Name:
BDBM50455417
Synonyms:
CHEMBL4211016
Type:
Small organic molecule
Emp. Form.:
C19H24N2O2
Mol. Mass.:
312.4061
SMILES:
CC(C)(C)c1ccc(CCNC(=O)c2ccc(O)cc2N)cc1
: