Target
Bromodomain-containing protein 2
Ligand
BDBM50455480
Substrate
Meas. Tech.
ChEMBL_1754545 (CHEMBL4189305)
Kd
32±n/a nM
Citation
 Law, RPAtkinson, SJBamborough, PChung, CWDemont, EHGordon, LJLindon, MPrinjha, RKWatson, AJBHirst, DJ Discovery of Tetrahydroquinoxalines as Bromodomain and Extra-Terminal Domain (BET) Inhibitors with Selectivity for the Second Bromodomain. J Med Chem 61:4317-4334 (2018)  
Target
Name:
Bromodomain-containing protein 2
Synonyms:
BRD2 Bromodomain and extra-terminal motif (BET) Bromodomain-containing protein 2 (BRD2) RING3
Type:
Protein
Mol. Mass.:
88085.95
Organism:
Homo sapiens (Human)
Description:
P25440
Residue:
801
  
Inhibitor
Name:
BDBM50455480
Synonyms:
CHEMBL4218735
Type:
Small organic molecule
Emp. Form.:
C26H31N3O2
Mol. Mass.:
417.5432
SMILES:
CC(=O)N1[C@H](CN(Cc2ccccc2CO)c2cc(ccc12)C1=CCNCC1)C1CC1
: