Target
Bromodomain and WD repeat-containing protein 1
Ligand
BDBM50455480
Substrate
Meas. Tech.
ChEMBL_1754552 (CHEMBL4189312)
Kd
15136±n/a nM
Citation
 Law, RPAtkinson, SJBamborough, PChung, CWDemont, EHGordon, LJLindon, MPrinjha, RKWatson, AJBHirst, DJ Discovery of Tetrahydroquinoxalines as Bromodomain and Extra-Terminal Domain (BET) Inhibitors with Selectivity for the Second Bromodomain. J Med Chem 61:4317-4334 (2018)  
Target
Name:
Bromodomain and WD repeat-containing protein 1
Synonyms:
BRWD1 Bromodomain and WD repeat-containing protein 1 C21orf107 WDR9
Type:
PROTEIN
Mol. Mass.:
262994.15
Organism:
Homo sapiens (Human)
Description:
ChEMBL_109516
Residue:
2320
  
Inhibitor
Name:
BDBM50455480
Synonyms:
CHEMBL4218735
Type:
Small organic molecule
Emp. Form.:
C26H31N3O2
Mol. Mass.:
417.5432
SMILES:
CC(=O)N1[C@H](CN(Cc2ccccc2CO)c2cc(ccc12)C1=CCNCC1)C1CC1
: