Target
Transcription intermediary factor 1-alpha
Ligand
BDBM50455480
Substrate
Meas. Tech.
ChEMBL_1754573 (CHEMBL4189333)
Kd
<30200±n/a nM
Citation
 Law, RPAtkinson, SJBamborough, PChung, CWDemont, EHGordon, LJLindon, MPrinjha, RKWatson, AJBHirst, DJ Discovery of Tetrahydroquinoxalines as Bromodomain and Extra-Terminal Domain (BET) Inhibitors with Selectivity for the Second Bromodomain. J Med Chem 61:4317-4334 (2018)  
Target
Name:
Transcription intermediary factor 1-alpha
Synonyms:
6.3.2.- RING finger protein 82 RNF82 TIF1-alpha TIF1A_HUMAN Transcription intermediary factor 1-alpha | Tripartite motif-containing protein 24
Type:
PROTEIN
Mol. Mass.:
116839.55
Organism:
Homo sapiens (Human)
Description:
ChEMBL_107998
Residue:
1050
  
Inhibitor
Name:
BDBM50455480
Synonyms:
CHEMBL4218735
Type:
Small organic molecule
Emp. Form.:
C26H31N3O2
Mol. Mass.:
417.5432
SMILES:
CC(=O)N1[C@H](CN(Cc2ccccc2CO)c2cc(ccc12)C1=CCNCC1)C1CC1
: