Target
Adenosine receptor A2b
Ligand
BDBM50268232
Substrate
Meas. Tech.
ChEMBL_1754719 (CHEMBL4189479)
IC50
18±n/a nM
Citation
 Köse, MGollos, SKarcz, TFiene, AHeisig, FBehrenswerth, AKie?-Kononowicz, KNamasivayam, VMüller, CE Fluorescent-Labeled Selective Adenosine A J Med Chem 61:4301-4316 (2018)  
Target
Name:
Adenosine receptor A2b
Synonyms:
AA2BR_HUMAN ADORA2B Adenosine receptors A2b | Adenosine receptors; A2a & A2b
Type:
G Protein-Coupled Receptor (GPCR)
Mol. Mass.:
36341.22
Organism:
Homo sapiens (Human)
Description:
Residue:
332
  
Inhibitor
Name:
BDBM50268232
Synonyms:
8-(4-(4-(4-Chlorophenyl)piperazine-1-sulfonyl)phenyl)-1-propyl-3,7-dihydropurine-2,6-dione | CHEMBL483688
Type:
Small organic molecule
Emp. Form.:
C24H25ClN6O4S
Mol. Mass.:
529.011
SMILES:
CCCn1c(=O)[nH]c2nc([nH]c2c1=O)-c1ccc(cc1)S(=O)(=O)N1CCN(CC1)c1ccc(Cl)cc1
: