Target
Vitamin D3 receptor
Ligand
BDBM50455852
Substrate
Meas. Tech.
ChEMBL_1754989 (CHEMBL4189749)
IC50
3.5±n/a nM
Citation
 Gogoi, PSeoane, SSigüeiro, RGuiberteau, TMaestro, MAPérez-Fernández, RRochel, NMouriño, A Aromatic-Based Design of Highly Active and Noncalcemic Vitamin D Receptor Agonists. J Med Chem 61:4928-4937 (2018)  
Target
Name:
Vitamin D3 receptor
Synonyms:
1,25-dihydroxyvitamin D3 receptor Nuclear receptor subfamily 1 group I member 1 VDR | VDR_HUMAN
Type:
Protein
Mol. Mass.:
48288.72
Organism:
Homo sapiens (Human)
Description:
P11473
Residue:
427
  
Inhibitor
Name:
BDBM50455852
Synonyms:
CHEMBL4209452
Type:
Small organic molecule
Emp. Form.:
C31H48O3
Mol. Mass.:
468.711
SMILES:
CCCCCCC\C(=C/C=C1/C[C@@H](O)C[C@H](O)C1=C)c1cccc(CCCCCC(C)(C)O)c1
: