Target
Aldehyde dehydrogenase 1A1
Ligand
BDBM50456236
Substrate
Meas. Tech.
ChEMBL_1755231 (CHEMBL4189991)
IC50
15±n/a nM
Citation
 Yang, SMMartinez, NJYasgar, ADanchik, CJohansson, CWang, YBaljinnyam, BWang, AQXu, XShah, PCheff, DWang, XSRoth, JLal-Nag, MDunford, JEOppermann, UVasiliou, VSimeonov, AJadhav, AMaloney, DJ Discovery of Orally Bioavailable, Quinoline-Based Aldehyde Dehydrogenase 1A1 (ALDH1A1) Inhibitors with Potent Cellular Activity. J Med Chem 61:4883-4903 (2018)  
Target
Name:
Aldehyde dehydrogenase 1A1
Synonyms:
AL1A1_HUMAN ALDH-E1 ALDH1A1 Aldehyde dehydrogenase 1A1 (ALDH1A1) Aldehyde dehydrogenase family 1 member A1 (ALDH1A1) PUMB1 RalDH1 | Retinal dehydrogenase 1
Type:
Protein
Mol. Mass.:
54862.21
Organism:
Homo sapiens (Human)
Description:
Residue:
501
  
Inhibitor
Name:
BDBM50456236
Synonyms:
CHEMBL4214533
Type:
Small organic molecule
Emp. Form.:
C27H28ClN5O3S
Mol. Mass.:
538.061
SMILES:
CS(=O)(=O)N1CCN(CC1)C(=O)c1cnc2ccc(Cl)cc2c1N1CCC(CC1)(C#N)c1ccccc1
: