Target
Acetylcholinesterase
Ligand
BDBM50456711
Substrate
Meas. Tech.
ChEMBL_1757783 (CHEMBL4192791)
Ki
5.7±n/a nM
Citation
 Roldán-Peña, JMAlejandre-Ramos, DLópez, ÓMaya, ILagunes, IPadrón, JMPeña-Altamira, LEBartolini, MMonti, BBolognesi, MLFernández-Bolaños, JG New tacrine dimers with antioxidant linkers as dual drugs: Anti-Alzheimer's and antiproliferative agents. Eur J Med Chem 138:761-773 (2017)  
Target
Name:
Acetylcholinesterase
Synonyms:
ACES_ELEEL Acetylcholinesterase (EeAChE) | ache
Type:
Enzyme
Mol. Mass.:
71812.79
Organism:
Electrophorus electricus (Electric eel)
Description:
Residue:
633
  
Inhibitor
Name:
BDBM50456711
Synonyms:
CHEMBL4208641
Type:
Small organic molecule
Emp. Form.:
C36H46N4S2
Mol. Mass.:
598.907
SMILES:
C(CCNc1c2CCCCc2nc2ccccc12)CCSSCCCCCNc1c2CCCCc2nc2ccccc12
: