Target
Acetylcholinesterase
Ligand
BDBM50456708
Substrate
Meas. Tech.
ChEMBL_1757785 (CHEMBL4192793)
Ki
1.2±n/a nM
Citation
 Roldán-Peña, JMAlejandre-Ramos, DLópez, ÓMaya, ILagunes, IPadrón, JMPeña-Altamira, LEBartolini, MMonti, BBolognesi, MLFernández-Bolaños, JG New tacrine dimers with antioxidant linkers as dual drugs: Anti-Alzheimer's and antiproliferative agents. Eur J Med Chem 138:761-773 (2017)  
Target
Name:
Acetylcholinesterase
Synonyms:
ACES_ELEEL Acetylcholinesterase (EeAChE) | ache
Type:
Enzyme
Mol. Mass.:
71812.79
Organism:
Electrophorus electricus (Electric eel)
Description:
Residue:
633
  
Inhibitor
Name:
BDBM50456708
Synonyms:
CHEMBL4204315
Type:
Small organic molecule
Emp. Form.:
C36H46N4Se2
Mol. Mass.:
692.7
SMILES:
[#6](-[#6]-[#6]-[#7]-c1c2-[#6]-[#6]-[#6]-[#6]-c2nc2ccccc12)-[#6]-[#6][Se;v2][Se;v2][#6]-[#6]-[#6]-[#6]-[#6]-[#7]-c1c2-[#6]-[#6]-[#6]-[#6]-c2nc2ccccc12
: