Target
Adenosine receptor A1
Ligand
BDBM82010
Substrate
Meas. Tech.
ChEBML_29149
Ki
2.9±n/a nM
Citation
 Daly, JWPadgett, WLShamim, MT Analogues of 1,3-dipropyl-8-phenylxanthine: enhancement of selectivity at A1-adenosine receptors by aryl substituents. J Med Chem 29:1520-4 (1986)  
Target
Name:
Adenosine receptor A1
Synonyms:
AA1R_RAT ADENOSINE A1 high Adenosine A1 receptor (A1) Adenosine receptors A1 | Adora1
Type:
Protein
Mol. Mass.:
36704.13
Organism:
Rattus norvegicus (rat)
Description:
Residue:
326
  
Inhibitor
Name:
BDBM82010
Synonyms:
1,3-Dipropyl-8-(4-hydroxyphenyl)xanthine CHEMBL27155
Type:
Emp. Form.:
C17H20N4O3
Mol. Mass.:
328.3657
SMILES:
CCCn1c2nc([nH]c2c(=O)n(CCC)c1=O)-c1ccc(O)cc1
: