Target
Mitogen-activated protein kinase kinase kinase 14
Ligand
BDBM50457311
Substrate
Meas. Tech.
ChEMBL_1759316 (CHEMBL4194324)
IC50
1.8±n/a nM
Citation
 Kargbo, RB New Substituted Cyanoindoline Derivatives as MAP3K14 Kinase Inhibitors for the Treatment of Cancer and Autoimmune Disorders. ACS Med Chem Lett 8:908-910 (2017)  
Target
Name:
Mitogen-activated protein kinase kinase kinase 14
Synonyms:
HsNIK MAP3K14 NF-kappa-beta-inducing kinase (NF-kB) Serine/threonine-protein kinase NIK
Type:
Protein
Mol. Mass.:
104059.50
Organism:
Homo sapiens (Human)
Description:
Q99558
Residue:
947
  
Inhibitor
Name:
BDBM50457311
Synonyms:
CHEMBL4216964
Type:
Small organic molecule
Emp. Form.:
C29H31N7O2
Mol. Mass.:
509.6021
SMILES:
Cc1cc(CCN2CCOCC2)c(cc1Nc1nccc(n1)-c1cc2c(NC[C@]2(C)CO)c(c1)C#N)C#N
: