Target
Glucocorticoid receptor
Ligand
BDBM19190
Substrate
Meas. Tech.
ChEMBL_1759600 (CHEMBL4194608)
IC50
52±n/a nM
Citation
 Ripa, LEdman, KDearman, MEdenro, GHendrickx, RUllah, VChang, HFLepistö, MChapman, DGeschwindner, SWissler, LSvanberg, PLawitz, KMalmberg, JNikitidis, AOlsson, RIBird, JLlinas, AHegelund-Myrbäck, TBerger, MThorne, PHarrison, RKöhler, CDrmota, T Discovery of a Novel Oral Glucocorticoid Receptor Modulator (AZD9567) with Improved Side Effect Profile. J Med Chem 61:1785-1799 (2018)  
Target
Name:
Glucocorticoid receptor
Synonyms:
GCR_RAT Glucocorticoid Receptor (GR) Grl | Nr3c1
Type:
Enzyme Catalytic Domain
Mol. Mass.:
87556.83
Organism:
RAT
Description:
Glucocorticoid 0 RAT::P06536
Residue:
795
  
Inhibitor
Name:
BDBM19190
Synonyms:
(1S,2R,10S,11S,14R,15S,17S)-14,17-dihydroxy-14-(2-hydroxyacetyl)-2,15-dimethyltetracyclo[8.7.0.0^{2,7}.0^{11,15}]heptadeca-3,6-dien-5-one Delta-Cortef Prednisolone | US10196374, Prednisolone
Type:
Steroid
Emp. Form.:
C21H28O5
Mol. Mass.:
360.444
SMILES:
[H][C@@]12CC[C@](O)(C(=O)CO)[C@@]1(C)C[C@H](O)[C@@]1([H])[C@@]2([H])CCC2=CC(=O)C=C[C@]12C
: