Target
Retinoic acid receptor beta
Ligand
BDBM50048280
Substrate
Meas. Tech.
ChEMBL_1760058 (CHEMBL4195066)
EC50
2.0±n/a nM
Citation
 Thoreau, EArlabosse, JMBouix-Peter, CChambon, SChantalat, LDaver, SDumais, LDuvert, GFeret, AOuvry, GPascau, JRaffin, CRodeville, NSoulet, CTabet, STalano, SPortal, T Structure-based design of Trifarotene (CD5789), a potent and selective RAR? agonist for the treatment of acne. Bioorg Med Chem Lett 28:1736-1741 (2018)  
Target
Name:
Retinoic acid receptor beta
Synonyms:
HAP NR1B2 RAR-beta RARB Retinoic acid receptor RXR-alpha/Retinoic acid receptor beta Retinoid receptor
Type:
PROTEIN
Mol. Mass.:
50498.70
Organism:
Homo sapiens (Human)
Description:
ChEMBL_1458015
Residue:
455
  
Inhibitor
Name:
BDBM50048280
Synonyms:
6-(3-(1-Adamantyl)-4-methoxyphenyl)-2-naphthoic acid ADAPALENE | CHEMBL1265
Type:
Small organic molecule
Emp. Form.:
C28H28O3
Mol. Mass.:
412.5201
SMILES:
COc1ccc(cc1C12CC3CC(CC(C3)C1)C2)-c1ccc2cc(ccc2c1)C(O)=O
: