Target
Retinoic acid receptor beta
Ligand
BDBM50457543
Substrate
Meas. Tech.
ChEMBL_1760064 (CHEMBL4195072)
EC50
9.5±n/a nM
Citation
 Thoreau, EArlabosse, JMBouix-Peter, CChambon, SChantalat, LDaver, SDumais, LDuvert, GFeret, AOuvry, GPascau, JRaffin, CRodeville, NSoulet, CTabet, STalano, SPortal, T Structure-based design of Trifarotene (CD5789), a potent and selective RAR? agonist for the treatment of acne. Bioorg Med Chem Lett 28:1736-1741 (2018)  
Target
Name:
Retinoic acid receptor beta
Synonyms:
HAP NR1B2 RAR-beta RARB Retinoic acid receptor RXR-alpha/Retinoic acid receptor beta Retinoid receptor
Type:
PROTEIN
Mol. Mass.:
50498.70
Organism:
Homo sapiens (Human)
Description:
ChEMBL_1458015
Residue:
455
  
Inhibitor
Name:
BDBM50457543
Synonyms:
CHEMBL3934863
Type:
Small organic molecule
Emp. Form.:
C28H28F3NO4
Mol. Mass.:
499.5214
SMILES:
OCCCCOc1ccc(cc1-c1ccc(N2CCCC2)c(c1)C(F)(F)F)-c1ccc(cc1)C(O)=O
: