Target
5-hydroxytryptamine receptor 2A
Ligand
BDBM50014945
Substrate
Meas. Tech.
ChEMBL_1760136 (CHEMBL4195144)
EC50
2.0±n/a nM
Citation
 Pa?czyk, KPytka, KJakubczyk, MRapacz, ASa?at, KFurga?a, ASiwek, AG?uch-Lutwin, MGrybo?, AS?oczy?ska, KP?kala, E?mudzki, PBucki, AKo?aczkowski, M?elaszczyk, DMarona, HWaszkielewicz, AM Synthesis and activity of di- or trisubstituted N-(phenoxyalkyl)- or N-{2-[2-(phenoxy)ethoxy]ethyl}piperazine derivatives on the central nervous system. Bioorg Med Chem Lett 28:2039-2049 (2018)  
Target
Name:
5-hydroxytryptamine receptor 2A
Synonyms:
5-HT-2 5-HT2A 5-hydroxytryptamine receptor 2A (5HT-2A) 5HT2A_HUMAN HTR2A | Serotonin receptor 2A
Type:
undefined
Mol. Mass.:
52607.65
Organism:
Homo sapiens (Human)
Description:
P28223
Residue:
471
  
Inhibitor
Name:
BDBM50014945
Synonyms:
3-(2-aminopropyl)-1H-indol-5-ol alpha-M-5-HT alpha-methyl-5-hydroxytryptamine | alpha-methylserotonin
Type:
Small organic molecule
Emp. Form.:
C11H14N2O
Mol. Mass.:
190.2417
SMILES:
CC(N)Cc1c[nH]c2ccc(O)cc12
: