Target
Parathyroid hormone/parathyroid hormone-related peptide receptor
Ligand
BDBM50457783
Substrate
Meas. Tech.
ChEMBL_1760657 (CHEMBL4195665)
EC50
>1000000±n/a nM
Citation
 Nishimura, YEsaki, TIsshiki, YOkamoto, NFuruta, YKotake, TWatanabe, YOhta, MNakagawa, TNoda, HShimizu, MSaito, HTamura, TSato, H Development of a Novel Human Parathyroid Hormone Receptor 1 (hPTHR1) Agonist (CH5447240), a Potent and Orally Available Small Molecule for Treatment of Hypoparathyroidism. J Med Chem 61:5949-5962 (2018)  
Target
Name:
Parathyroid hormone/parathyroid hormone-related peptide receptor
Synonyms:
PTH/PTHr receptor PTH1 receptor PTH1R_HUMAN PTHR1 Parathyroid hormone receptor
Type:
Enzyme Catalytic Domain
Mol. Mass.:
66370.95
Organism:
Homo sapiens (Human)
Description:
PARATHYROID HT1 0 HUMAN::Q03431
Residue:
593
  
Inhibitor
Name:
BDBM50457783
Synonyms:
CHEMBL4214849
Type:
Small organic molecule
Emp. Form.:
C22H31N3O3S
Mol. Mass.:
417.565
SMILES:
Cc1ccccc1CCS(=O)(=O)N1CCC2(CC1)N=C(NC2=O)C1CCCCC1
: