Target
Probable maltase-glucoamylase 2
Ligand
BDBM50457915
Substrate
Meas. Tech.
ChEMBL_1761002 (CHEMBL4196249)
IC50
19100±n/a nM
Citation
 Zhang, XQMou, XFMao, NHao, JJLiu, MZheng, JYWang, CYGu, YCShao, CL Design, semisynthesis, ?-glucosidase inhibitory, cytotoxic, and antibacterial activities of p-terphenyl derivatives. Eur J Med Chem 146:232-244 (2018)  
Target
Name:
Probable maltase-glucoamylase 2
Synonyms:
3.2.1.3 Glucoamylase MGAM2 Probable maltase-glucoamylase 2
Type:
PROTEIN
Mol. Mass.:
277932.17
Organism:
Homo sapiens
Description:
ChEMBL_116927
Residue:
2515
  
Inhibitor
Name:
BDBM50457915
Synonyms:
CHEMBL4207664
Type:
Small organic molecule
Emp. Form.:
C27H24O5
Mol. Mass.:
428.4765
SMILES:
COc1cc(c(OC)c(OCc2ccccc2)c1-c1ccc(O)cc1)-c1ccc(O)cc1
: