Target
Broad substrate specificity ATP-binding cassette transporter ABCG2
Ligand
BDBM50457994
Substrate
Meas. Tech.
ChEMBL_1761215 (CHEMBL4196462)
IC50
62±n/a nM
Citation
 Köhler, SCVahdati, SScholz, MSWiese, M Structure activity relationships, multidrug resistance reversal and selectivity of heteroarylphenyl ABCG2 inhibitors. Eur J Med Chem 146:483-500 (2018)  
Target
Name:
Broad substrate specificity ATP-binding cassette transporter ABCG2
Synonyms:
ABCG2 ABCP ATP-binding cassette sub-family G member 2 ATP-binding cassette, sub-family G, member 2 BCRP1 CDw338 Mitoxantrone resistance-associated protein Urate exporter
Type:
Multi-pass membrane protein; monomer or homodimer; disulfide-linked
Mol. Mass.:
72329.48
Organism:
Homo sapiens (Human)
Description:
Q9UNQ0
Residue:
655
  
Inhibitor
Name:
BDBM50457994
Synonyms:
CHEMBL4202709
Type:
Small organic molecule
Emp. Form.:
C21H18N6O3
Mol. Mass.:
402.406
SMILES:
COc1ccc(cc1)C(=O)Nc1ccccc1-c1nnn(n1)-c1ccc(OC)nc1
: