Target
Cyclin-dependent kinase 6/G1/S-specific cyclin-D3
Ligand
BDBM50458024
Substrate
Meas. Tech.
ChEMBL_1761807 (CHEMBL4197054)
IC50
1.6±n/a nM
Citation
 Zha, CDeng, WFu, YTang, SLan, XYe, YSu, YJiang, LChen, YHuang, YDing, JGeng, MHuang, MWan, H Design, synthesis and biological evaluation of tetrahydronaphthyridine derivatives as bioavailable CDK4/6 inhibitors for cancer therapy. Eur J Med Chem 148:140-153 (2018)  
Target
Name:
Cyclin-dependent kinase 6/G1/S-specific cyclin-D3
Synonyms:
CDK6/CycD3 CDK6/G1/S-specific cyclin D3 Cyclin-dependent kinase 6 | Cyclin-dependent kinase 6/G1/S-specific cyclin D3
Type:
Protein
Mol. Mass.:
Description:
Components:
This complex has 2 components.
Component 1
Name:
Cyclin-dependent kinase 6
Synonyms:
CDK6 CDKN6 Cyclin-dependent kinase 6 (CDK 6) | Serine/threonine-protein kinase PLSTIRE
Type:
Enzyme Subunit
Mol. Mass.:
36937.42
Organism:
Homo sapiens (Human)
Description:
Q00534
Residue:
326
  
Component 2
Name:
G1/S-specific cyclin-D3
Synonyms:
CCND3 | CCND3_HUMAN
Type:
Enzyme
Mol. Mass.:
32521.90
Organism:
Homo sapiens (Human)
Description:
P30281
Residue:
292
  
Inhibitor
Name:
BDBM50458024
Synonyms:
CHEMBL4203179
Type:
Small organic molecule
Emp. Form.:
C30H36F2N8
Mol. Mass.:
546.6572
SMILES:
CCN1CCC(CC1)N1CCc2nc(Nc3ncc(F)c(n3)-c3cc(F)c4nc(C)n(C(C)C)c4c3)ccc2C1
: