Target
Beta-lactamase TEM
Ligand
BDBM50021954
Substrate
Meas. Tech.
ChEMBL_40226 (CHEMBL653999)
IC50
10000±n/a nM
Citation
 Micetich, RGMaiti, SNSpevak, PHall, TWYamabe, SIshida, NTanaka, MYamazaki, TNakai, AOgawa, K Synthesis and beta-lactamase inhibitory properties of 2 beta-[(1,2,3-triazol-1-yl)methyl]-2 alpha-methylpenam-3 alpha-carboxylic acid 1,1-dioxide and related triazolyl derivatives. J Med Chem 30:1469-74 (1987)  
Target
Name:
Beta-lactamase TEM
Synonyms:
BLAT_ECOLX Beta-lactamase (TEM-1) Beta-lactamase TEM-1 Beta-lactamase TEM1D Beta-lactamase TEM1F TEM extended-spectrum beta-lactamase bla
Type:
Enzyme
Mol. Mass.:
31512.33
Organism:
Escherichia coli
Description:
P62593
Residue:
286
  
Inhibitor
Name:
BDBM50021954
Synonyms:
(2S,5R)-3,3-Dimethyl-4,4,7-trioxo-4lambda*6*-thia-1-aza-bicyclo[3.2.0]heptane-2-carboxylic acid 3,3-Dimethyl-4,4,7-trioxo-4lambda*6*-thia-1-aza-bicyclo[3.2.0]heptane-2-carboxylic acid CHEMBL403 SULBACTAM US20230322715, Compound ALK-09 | US9120808, Sulbactam sodium salt
Type:
Small organic molecule
Emp. Form.:
C8H11NO5S
Mol. Mass.:
233.242
SMILES:
CC1(C)[C@@H](N2[C@@H](CC2=O)S1(=O)=O)C(O)=O
: