Target
Kappa-type opioid receptor
Ligand
BDBM50083926
Substrate
Meas. Tech.
ChEMBL_1762408 (CHEMBL4197655)
Ki
0.052000±n/a nM
Citation
 Turnaturi, RMarrazzo, AParenti, CPasquinucci, L Benzomorphan scaffold for opioid analgesics and pharmacological tools development: A comprehensive review. Eur J Med Chem 148:410-422 (2018)  
Target
Name:
Kappa-type opioid receptor
Synonyms:
Kappa Opioid Receptor OPRK1 Opiate Kappa 1 | mu/kappa opioid receptor
Type:
G Protein-Coupled Receptor (GPCR)
Mol. Mass.:
42744.99
Organism:
Cavia porcellus (domestic guinea pig)
Description:
P41144
Residue:
380
  
Inhibitor
Name:
BDBM50083926
Synonyms:
(6S,11R)-3-Cyclopropylmethyl-6,11-dimethyl-1,2,3,4,5,6-hexahydro-2,6-methano-benzo[d]azocin-8-ol (cyclazocine)2-{4-[(2,4-Diamino-pteridin-6-ylmethyl)-methyl-amino]-benzoylamino}-pentanedioic acid 3-Cyclopropylmethyl-6,11-dimethyl-1,2,3,4,5,6-hexahydro-2,6-methano-benzo[d]azocin-8-ol (cyclazocine) 3-Cyclopropylmethyl-8-hydroxy-6,11-dimethyl-1,2,3,4,5,6-hexahydro-2,6-methano-benzo[d]azocinium BDBM50451129 CYCLAZOCINE
Type:
Small organic molecule
Emp. Form.:
C18H25NO
Mol. Mass.:
271.3972
SMILES:
C[C@H]1[C@H]2Cc3ccc(O)cc3[C@@]1(C)CCN2CC1CC1
: