Target
Prostacyclin synthase
Ligand
BDBM50000317
Substrate
Meas. Tech.
ChEBML_152777
IC50
>100000±n/a nM
Citation
 Cross, PEDickinson, RPParry, MJRandall, MJ Selective thromboxane synthetase inhibitors. 2. 3-(1H-imidazol-1-ylmethyl)-2-methyl-1H-indole-1-propanoic acid and analogues. J Med Chem 29:342-6 (1986)  
Target
Name:
Prostacyclin synthase
Synonyms:
CYP8 PTGIS Prostaglandin I2 synthase
Type:
PROTEIN
Mol. Mass.:
57109.87
Organism:
Homo sapiens (Human)
Description:
ChEMBL_157785
Residue:
500
  
Inhibitor
Name:
BDBM50000317
Synonyms:
3-(3-Imidazol-1-ylmethyl-2-methyl-indol-1-yl)-propionic acid CHEMBL283656 UK-38485
Type:
Small organic molecule
Emp. Form.:
C16H17N3O2
Mol. Mass.:
283.3251
SMILES:
Cc1c(Cn2ccnc2)c2ccccc2n1CCC(O)=O
: