Target
Cytochrome P450 11B1, mitochondrial
Ligand
BDBM50000317
Substrate
Meas. Tech.
ChEBML_194
IC50
>100000±n/a nM
Citation
 Cross, PEDickinson, RPParry, MJRandall, MJ Selective thromboxane synthetase inhibitors. 2. 3-(1H-imidazol-1-ylmethyl)-2-methyl-1H-indole-1-propanoic acid and analogues. J Med Chem 29:342-6 (1986)  
Target
Name:
Cytochrome P450 11B1, mitochondrial
Synonyms:
C11B1_RAT Cyp11b1 Cytochrome P450 11B1
Type:
PROTEIN
Mol. Mass.:
57478.87
Organism:
Rattus norvegicus
Description:
ChEMBL_1475489
Residue:
499
  
Inhibitor
Name:
BDBM50000317
Synonyms:
3-(3-Imidazol-1-ylmethyl-2-methyl-indol-1-yl)-propionic acid CHEMBL283656 UK-38485
Type:
Small organic molecule
Emp. Form.:
C16H17N3O2
Mol. Mass.:
283.3251
SMILES:
Cc1c(Cn2ccnc2)c2ccccc2n1CCC(O)=O
: