Target
Cytochrome P450 11B1, mitochondrial
Ligand
BDBM50022216
Substrate
Meas. Tech.
ChEBML_195
IC50
>100000±n/a nM
Citation
 Cross, PEDickinson, RPParry, MJRandall, MJ Selective thromboxane synthetase inhibitors. 4. 2-(1H-imidazol-1-ylmethyl) carboxylic acids of benzo[b]furan, benzo[b]thiophene, indole, and naphthalene. J Med Chem 29:1643-50 (1986)  
Target
Name:
Cytochrome P450 11B1, mitochondrial
Synonyms:
C11B1_RAT Cyp11b1 Cytochrome P450 11B1
Type:
PROTEIN
Mol. Mass.:
57478.87
Organism:
Rattus norvegicus
Description:
ChEMBL_1475489
Residue:
499
  
Inhibitor
Name:
BDBM50022216
Synonyms:
2-Imidazol-1-ylmethyl-3-methyl-benzo[b]thiophene-5-carboxylic acid | CHEMBL43141
Type:
Small organic molecule
Emp. Form.:
C14H12N2O2S
Mol. Mass.:
272.322
SMILES:
Cc1c(Cn2ccnc2)sc2ccc(cc12)C(O)=O
: