Target
Replicase polyprotein 1ab
Ligand
BDBM50458465
Substrate
Meas. Tech.
ChEMBL_1763459 (CHEMBL4198706)
IC50
6300±n/a nM
Citation
 Galasiti Kankanamalage, ACKim, YDamalanka, VCRathnayake, ADFehr, ARMehzabeen, NBattaile, KPLovell, SLushington, GHPerlman, SChang, KOGroutas, WC Structure-guided design of potent and permeable inhibitors of MERS coronavirus 3CL protease that utilize a piperidine moiety as a novel design element. Eur J Med Chem 150:334-346 (2018)  
Target
Name:
Replicase polyprotein 1ab
Synonyms:
3C-like proteinase 3C-like proteinase (SARS-CoV 3Cpro) 3CLp GFL Guanine-N7 methyltransferase Helicase Leader protein Non-structural protein 10 Non-structural protein 3 Non-structural protein 6 Non-structural protein 8 ORF1ab polyprotein PL2-PRO Pol R1AB_SARS RdRp SARS coronavirus main proteinase nsp1 nsp12 nsp14 nsp16 nsp3 nsp5 nsp7 nsp9 pp1ab | rep
Type:
Protein
Mol. Mass.:
790250.81
Organism:
Human SARS coronavirus (SARS-CoV) (Severe acute respiratory syndrome coronavirus)
Description:
P0C6X7
Residue:
7073
  
Inhibitor
Name:
BDBM50458465
Synonyms:
CHEMBL4203883
Type:
Small organic molecule
Emp. Form.:
C31H47N4NaO10S
Mol. Mass.:
690.78
SMILES:
[Na;v0+].[#6]-[#6](-[#6])-[#6]-[#6@H](-[#7]-[#6](=O)-[#8]C1([#6]-c2ccccc2)[#6]-[#6]-[#7](-[#6]-[#6]1)-[#6](=O)-[#8]C([#6])([#6])[#6])-[#6](=O)-[#7]-[#6@@H](-[#6]-[#6@@H]-1-[#6]-[#6]-[#7]-[#6]-1=O)-[#6](-[#8])S([#8-])(=O)=O
: