Target
Macrophage migration inhibitory factor
Ligand
BDBM50458539
Substrate
Meas. Tech.
ChEMBL_1764061 (CHEMBL4199308)
IC50
810±n/a nM
Citation
 Trivedi-Parmar, VJorgensen, WL Advances and Insights for Small Molecule Inhibition of Macrophage Migration Inhibitory Factor. J Med Chem 61:8104-8119 (2018)  
Target
Name:
Macrophage migration inhibitory factor
Synonyms:
GIF Glycosylation-inhibiting factor L-dopachrome tautomerase MIF/CD74 (Macrophage migration inhibitory factor and HLA-DR antigens-associated invariant chain) MMIF Macrophage migration inhibitory factor (MIF) | Phenylpyruvate tautomerase
Type:
Enzyme
Mol. Mass.:
12478.18
Organism:
Homo sapiens (Human)
Description:
P14174
Residue:
115
  
Inhibitor
Name:
BDBM50458539
Synonyms:
CHICAGO SKY BLUE SODIUM Chicago Sky Blue 6B
Type:
Small organic molecule
Emp. Form.:
C34H24N6Na4O16S4
Mol. Mass.:
992.804
SMILES:
[Na;v0+].[Na;v0+].[Na;v0+].[Na;v0+].[#6]-[#8]-c1cc(ccc1\[#7]=[#7]\c1ccc2c(cc(c(-[#7])c2c1-[#8])S([#8-])(=O)=O)S([#8-])(=O)=O)-c1ccc(\[#7]=[#7]\c2ccc3c(cc(c(-[#7])c3c2-[#8])S([#8-])(=O)=O)S([#8-])(=O)=O)c(-[#8]-[#6])c1
: