Target
Rhizopuspepsin
Ligand
BDBM50022285
Substrate
Meas. Tech.
ChEBML_222282
Ki
33±n/a nM
Citation
 Salituro, FGAgarwal, NHofmann, TRich, DH Inhibition of aspartic proteinases by peptides containing lysine and ornithine side-chain analogues of statine. J Med Chem 30:286-95 (1987)  
Target
Name:
Rhizopuspepsin
Synonyms:
CARP_RHICH | Rhizopuspepsin
Type:
PROTEIN
Mol. Mass.:
41326.43
Organism:
Rhizopus microsporus var. chinensis
Description:
ChEMBL_100244
Residue:
393
  
Inhibitor
Name:
BDBM50022285
Synonyms:
(3S,4S) Acetate7-ethoxycarbonyl-6-hydroxy-5-{3-methyl-2-[3-methyl-2-(3-methyl-butyrylamino)-butyrylamino]-butyrylamino}-heptyl-ammonium; | CHEMBL98880
Type:
Small organic molecule
Emp. Form.:
C25H49N4O6
Mol. Mass.:
501.6792
SMILES:
CCOC(=O)C[C@H](O)[C@H](CCCC[NH3+])NC(=O)[C@H](NC(=O)C(NC(=O)CC(C)C)C(C)C)C(C)C
: