Target
Tyrosine-protein kinase ITK/TSK
Ligand
BDBM50458596
Substrate
Meas. Tech.
ChEMBL_1764256 (CHEMBL4199503)
IC50
0.720000±n/a nM
Citation
 Blass, BE Covalent Inhibitors of the TEC Family of Kinases and Their Methods of Use. ACS Med Chem Lett 9:587-589 (2018)  
Target
Name:
Tyrosine-protein kinase ITK/TSK
Synonyms:
EMT ITK_HUMAN LYK Tyrosine-protein kinase ITK Tyrosine-protein kinase Lyk
Type:
Protein
Mol. Mass.:
71839.20
Organism:
Homo sapiens (Human)
Description:
Q08881
Residue:
620
  
Inhibitor
Name:
BDBM50458596
Synonyms:
CHEMBL4216187 | US10752615, Compound 50
Type:
Small organic molecule
Emp. Form.:
C26H26N6O3S
Mol. Mass.:
502.588
SMILES:
CNc1ccc2n([C@H]3C[C@]4(C3)CCN(C4)C(=O)C=C)c(NC(=O)c3ccc(s3)-c3cnco3)nc2c1
: