Target
Tyrosine-protein kinase ITK/TSK
Ligand
BDBM50458600
Substrate
Meas. Tech.
ChEMBL_1764256 (CHEMBL4199503)
IC50
0.530000±n/a nM
Citation
 Blass, BE Covalent Inhibitors of the TEC Family of Kinases and Their Methods of Use. ACS Med Chem Lett 9:587-589 (2018)  
Target
Name:
Tyrosine-protein kinase ITK/TSK
Synonyms:
EMT ITK_HUMAN LYK Tyrosine-protein kinase ITK Tyrosine-protein kinase Lyk
Type:
Protein
Mol. Mass.:
71839.20
Organism:
Homo sapiens (Human)
Description:
Q08881
Residue:
620
  
Inhibitor
Name:
BDBM50458600
Synonyms:
CHEMBL4206765 | US10752615, Compound 97
Type:
Small organic molecule
Emp. Form.:
C27H25N5O3S
Mol. Mass.:
499.584
SMILES:
C=CC(=O)N1CC[C@@]2(C[C@@H](C2)n2c(NC(=O)c3ccc(s3)-c3cc[nH]c(=O)c3)nc3ccccc23)C1
: