Target
Cathepsin D
Ligand
BDBM50022510
Substrate
Meas. Tech.
ChEBML_44976
pH
3.2±n/a
IC50
4±n/a nM
Comments
extracted
Citation
 Maibaum, JRich, DH Inhibition of porcine pepsin by two substrate analogues containing statine. The effect of histidine at the P2 subsite on the inhibition of aspartic proteinases. J Med Chem 31:625-9 (1988)  
Target
Name:
Cathepsin D
Synonyms:
CATD_BOVIN | CTSD
Type:
PROTEIN
Mol. Mass.:
42158.92
Organism:
Bos taurus
Description:
ChEMBL_1458606
Residue:
387
  
Inhibitor
Name:
BDBM50022510
Synonyms:
Boc-Phe-His-Leu-CF3-Ile-Amp | CHEMBL154795
Type:
Small organic molecule
Emp. Form.:
C40H54F2N8O7
Mol. Mass.:
796.903
SMILES:
CC[C@H](C)[C@H](NC(=O)C(F)(F)C(=O)C(CC(C)C)NC(=O)[C@H](Cc1cnc[nH]1)NC(=O)[C@H](Cc1ccccc1)NC(=O)OC(C)(C)C)C(=O)NCc1ccccn1
: