Target
Pepsin A
Ligand
BDBM50421761
Substrate
Meas. Tech.
ChEBML_153984
pH
2±n/a
IC50
60±n/a nM
Comments
extracted
Citation
 Maibaum, JRich, DH Inhibition of porcine pepsin by two substrate analogues containing statine. The effect of histidine at the P2 subsite on the inhibition of aspartic proteinases. J Med Chem 31:625-9 (1988)  
Target
Name:
Pepsin A
Synonyms:
PEPA_PIG Pepsin | Pepsin A precursor
Type:
Enzyme
Mol. Mass.:
41232.87
Organism:
Porcine
Description:
Residue:
385
  
Inhibitor
Name:
BDBM50421761
Synonyms:
CHEMBL2311113
Type:
Small organic molecule
Emp. Form.:
C42H63N5O10
Mol. Mass.:
797.9771
SMILES:
COC(=O)CC(O)[C@H](CC(C)C)NC(=O)[C@H](C)NC(=O)CC(O)[C@H](CC(C)C)NC(=O)[C@@H](NC(=O)[C@H](Cc1ccccc1)NC(=O)OCc1ccccc1)C(C)C
: