Target
Renin
Ligand
BDBM50022525
Substrate
Meas. Tech.
ChEMBL_195964 (CHEMBL806858)
IC50
52±n/a nM
Citation
 Iizuka, KKamijo, TKubota, TAkahane, KUmeyama, HKiso, Y New human renin inhibitors containing an unnatural amino acid, norstatine. J Med Chem 31:701-4 (1988)  
Target
Name:
Renin
Synonyms:
Angiotensinogenase RENI_HUMAN
Type:
Enzyme
Mol. Mass.:
45058.99
Organism:
Homo sapiens (Human)
Description:
Residue:
406
  
Inhibitor
Name:
BDBM50022525
Synonyms:
2-Hydroxy-3-[3-(1H-imidazol-4-yl)-2-(4-morpholin-4-yl-2-naphthalen-1-ylmethyl-4-oxo-butyrylamino)-propionylamino]-5-methyl-hexanoic acid methyl ester | CHEMBL159389
Type:
Small organic molecule
Emp. Form.:
C33H43N5O7
Mol. Mass.:
621.7238
SMILES:
COC(=O)C(O)C(CC(C)C)NC(=O)C(Cc1cnc[nH]1)NC(=O)C(CC(=O)N1CCOCC1)Cc1cccc2ccccc12
: