Target
Muscarinic acetylcholine receptor M4
Ligand
BDBM50458993
Substrate
Meas. Tech.
ChEMBL_1765196 (CHEMBL4200443)
EC50
18±n/a nM
Citation
 Kargbo, RB Allosteric Modulators of the M4 Muscarinic Acetylcholine Receptor. ACS Med Chem Lett 9:783-784 (2018)  
Target
Name:
Muscarinic acetylcholine receptor M4
Synonyms:
ACM4_HUMAN Cholinergic, muscarinic M4 Muscarinic acetylcholine receptor M2 and M4
Type:
Enzyme Catalytic Domain
Mol. Mass.:
53079.31
Organism:
Homo sapiens (Human)
Description:
Cholinergic, muscarinic M4 CHRM4 HUMAN M3::P08173
Residue:
479
  
Inhibitor
Name:
BDBM50458993
Synonyms:
CHEMBL4210497
Type:
Small organic molecule
Emp. Form.:
C18H24N4O2
Mol. Mass.:
328.4088
SMILES:
Cc1cc2c(cn[nH]c2=O)nc1N1CCC(CC1)OCC1(C)CC1
: