Target
TYR_PHOSPHATASE_2 domain-containing protein
Ligand
BDBM50459227
Substrate
Meas. Tech.
ChEMBL_1765863 (CHEMBL4201110)
IC50
1000±n/a nM
Citation
 Vickers, CFSilva, APGChakraborty, AFernandez, PKurepina, NSaville, CNaranjo, YPons, MSchnettger, LSGutierrez, MGPark, SKreiswith, BNPerlin, DSThomas, EJCavet, JSTabernero, L Structure-Based Design of MptpB Inhibitors That Reduce Multidrug-Resistant Mycobacterium tuberculosis Survival and Infection Burden in Vivo. J Med Chem 61:8337-8352 (2018)  
Target
Name:
TYR_PHOSPHATASE_2 domain-containing protein
Synonyms:
(PROTEIN-TYROSINE-PHOSPHATASE) (PTPase) PHOSPHOTYROSINE PROTEIN PHOSPHATASE PTPB Phosphotyrosine-protein phosphatase PTPB | Protein Tyrosine Phosphatase PTPB
Type:
Hydrolase
Mol. Mass.:
30152.45
Organism:
Mycobacterium tuberculosis
Description:
Residue:
276
  
Inhibitor
Name:
BDBM50459227
Synonyms:
CHEMBL4217308
Type:
Small organic molecule
Emp. Form.:
C22H13Cl2NO4
Mol. Mass.:
426.249
SMILES:
OC(=O)c1noc(c1-c1cccc(c1)-c1cc(Cl)c(O)c(Cl)c1)-c1ccccc1
: