Target
Butyrophilin subfamily 3 member A1
Ligand
BDBM50236893
Substrate
Meas. Tech.
ChEMBL_1766264 (CHEMBL4201511)
EC50
0.510000±n/a nM
Citation
 Lentini, NAFoust, BJHsiao, CCWiemer, AJWiemer, DF Phosphonamidate Prodrugs of a Butyrophilin Ligand Display Plasma Stability and Potent V?9 V?2 T Cell Stimulation. J Med Chem 61:8658-8669 (2018)  
Target
Name:
Butyrophilin subfamily 3 member A1
Synonyms:
BT3A1_HUMAN BTN3A1 CD_antigen=CD277
Type:
PROTEIN
Mol. Mass.:
57685.08
Organism:
Homo sapiens (Human)
Description:
ChEMBL_117363
Residue:
513
  
Inhibitor
Name:
BDBM50236893
Synonyms:
CHEBI:15664 | CHEMBL145233
Type:
Small organic molecule
Emp. Form.:
C5H12O8P2
Mol. Mass.:
262.0915
SMILES:
C\C(CO)=C/COP(O)(=O)OP(O)(O)=O
: