Target
5-hydroxytryptamine receptor 1A
Ligand
BDBM50001862
Substrate
Meas. Tech.
ChEBML_1196
Ki
68±n/a nM
Citation
 Glennon, RANaiman, NALyon, RATiteler, M Arylpiperazine derivatives as high-affinity 5-HT1A serotonin ligands. J Med Chem 31:1968-71 (1988)  
Target
Name:
5-hydroxytryptamine receptor 1A
Synonyms:
5-HT-1A 5-HT1A 5-hydroxytryptamine receptor 1A (5HT1A) 5ht1a Htr1a Serotonin 1a (5-HT1a) receptor/Adrenergic receptor alpha-1 | Serotonin receptor 1A
Type:
G Protein-Coupled Receptor (GPCR)
Mol. Mass.:
46445.29
Organism:
Rattus norvegicus (rat)
Description:
Binding assays were performed using rat hippocampal membranes.
Residue:
422
  
Inhibitor
Name:
BDBM50001862
Synonyms:
(N-(o-methoxyphenyl)piperazine)1-(2-Methoxy-phenyl)-piperazine 2-METHOXYPHENYLPIPERAZINE CHEMBL9666 | EN300-33366
Type:
Small organic molecule
Emp. Form.:
C11H16N2O
Mol. Mass.:
192.2575
SMILES:
COc1ccccc1N1CCNCC1
: