Target
Adenosine receptor A2a/A2b
Ligand
BDBM50022725
Substrate
Meas. Tech.
ChEMBL_184451 (CHEMBL789405)
Ki
820±n/a nM
Citation
 Peet, NPDickerson, GAAbdallah, AHDaly, JWUkena, D Benzo[1,2-c:5,4-c']dipyrazoles: non-xanthine adenosine antagonists. J Med Chem 31:2034-9 (1988)  
Target
Name:
Adenosine receptor A2a/A2b
Synonyms:
Adenosine A2 receptor
Type:
Mol. Mass.:
Description:
ASSAY_ID of ChEMBL is 30560
Components:
This complex has 2 components.
Component 1
Name:
Adenosine receptor A2b
Synonyms:
AA2BR_RAT Adora2b
Type:
PROTEIN
Mol. Mass.:
36378.84
Organism:
Rattus norvegicus
Description:
ChEMBL_32934
Residue:
332
  
Component 2
Name:
Adenosine receptor A2a
Synonyms:
AA2AR_RAT Adenosine A2 receptor Adenosine Receptors A2a (A2a) Adenosine receptors A2a Rat striatal adenosine A2a receptor
Type:
G Protein-Coupled Receptor (GPCR)
Mol. Mass.:
45015.65
Organism:
Rattus norvegicus (rat)
Description:
Rat A2A receptors expressed in CHO cells.
Residue:
410
  
Inhibitor
Name:
BDBM50022725
Synonyms:
1,3-Diallyl-3,7-dihydro-purine-2,6-dione | CHEMBL286785
Type:
Small organic molecule
Emp. Form.:
C11H12N4O2
Mol. Mass.:
232.2386
SMILES:
C=CCn1c2nc[nH]c2c(=O)n(CC=C)c1=O
: