Target
Neuronal acetylcholine receptor subunit alpha-3/alpha-6/beta-4
Ligand
BDBM50459662
Substrate
Meas. Tech.
ChEMBL_1766930 (CHEMBL4202177)
IC50
>10000±n/a nM
Citation
 Yu, JZhu, XHarvey, PJKaas, QZhangsun, DCraik, DJLuo, S Single Amino Acid Substitution in ?-Conotoxin TxID Reveals a Specific ?3?4 Nicotinic Acetylcholine Receptor Antagonist. J Med Chem 61:9256-9265 (2018)  
Target
Name:
Neuronal acetylcholine receptor subunit alpha-3/alpha-6/beta-4
Synonyms:
Nicotinic acetylcholine receptor alpha6/alpha3/beta4
Type:
Mol. Mass.:
Description:
ASSAY_ID of ChEMBL is 2103200
Components:
This complex has 3 components.
Component 1
Name:
Neuronal acetylcholine receptor subunit alpha-3
Synonyms:
ACHA3_RAT Chrna3
Type:
Enzyme
Mol. Mass.:
56995.52
Organism:
Rattus norvegicus (Rat)
Description:
P04757
Residue:
499
  
Component 2
Name:
Neuronal acetylcholine receptor subunit beta-4
Synonyms:
ACHB4_RAT Chrnb4 Neuronal acetylcholine receptor non-alpha-2 chain | Neuronal acetylcholine receptor protein beta-4 subunit
Type:
Enzyme
Mol. Mass.:
55863.89
Organism:
Rattus norvegicus (Rat)
Description:
P12392
Residue:
495
  
Component 3
Name:
Neuronal acetylcholine receptor subunit alpha-6
Synonyms:
ACHA6_RAT Chrna6 Neuronal acetylcholine receptor subunit alpha-6 | Neuronal acetylcholine receptor subunit alpha-6/beta-3
Type:
PROTEIN
Mol. Mass.:
56943.53
Organism:
Rattus norvegicus
Description:
ChEMBL_1454451
Residue:
493
  
Inhibitor
Name:
BDBM50459662
Synonyms:
CHEMBL4203278
Type:
Small organic molecule
Emp. Form.:
C59H92N18O19S5
Mol. Mass.:
1517.796
SMILES:
CC[C@H](C)[C@@H]1NC(=O)[C@@H]2CCCN2C(=O)[C@H](CO)NC(=O)[C@H](CCSC)NC(=O)[C@H](C)NC(=O)[C@H](CC(O)=O)NC(=O)[C@@H]2CSSC[C@H](NC(=O)CN)C(=O)N[C@@H](CSSC[C@H](NC1=O)C(N)=O)C(=O)N[C@@H](CO)C(=O)N[C@@H](Cc1cnc[nH]1)C(=O)N1CCC[C@H]1C(=O)N[C@@H](C(C)C)C(=O)N2
: