Target
Beta-lactamase TEM
Ligand
BDBM50022792
Substrate
Meas. Tech.
ChEBML_40718
Ki
50000±n/a nM
Citation
 Joyeau, RMolines, HLabia, RWakselman, M N-aryl 3-halogenated azetidin-2-ones and benzocarbacephems, inhibitors of beta-lactamases. J Med Chem 31:370-4 (1988)  
Target
Name:
Beta-lactamase TEM
Synonyms:
BLAT_ECOLX Beta-lactamase (TEM-1) Beta-lactamase TEM-1 Beta-lactamase TEM1D Beta-lactamase TEM1F TEM extended-spectrum beta-lactamase bla
Type:
Enzyme
Mol. Mass.:
31512.33
Organism:
Escherichia coli
Description:
P62593
Residue:
286
  
Inhibitor
Name:
BDBM50022792
Synonyms:
4-Chloro-1-oxo-2,2a,3,4-tetrahydro-1H-azeto[1,2-a]quinoline-7-carboxylic acid | CHEMBL122500
Type:
Small organic molecule
Emp. Form.:
C12H10ClNO3
Mol. Mass.:
251.666
SMILES:
OC(=O)c1ccc2C(Cl)CC3CC(=O)N3c2c1
: